Information card for entry 7226903
Formula |
C42 H37 N4 O16 Yb2 |
Calculated formula |
C42 H37 N4 O16 Yb2 |
Title of publication |
Syntheses, structures, color tunable and white‒light emitting lanthanide metal‒organic framework materials constructed from conjugated 1, 1'-butadiynebenzene-3, 3', 5, 5'-tetracarboxylate ligand |
Authors of publication |
Rong, Jiewei; Zhang, Wen-Wei; Bai, Junfeng |
Journal of publication |
RSC Adv. |
Year of publication |
2016 |
a |
29.8541 ± 0.001 Å |
b |
20.9459 ± 0.0006 Å |
c |
19.3789 ± 0.0006 Å |
α |
90° |
β |
94.071 ± 0.001° |
γ |
90° |
Cell volume |
12087.5 ± 0.7 Å3 |
Cell temperature |
296 ± 2 K |
Ambient diffraction temperature |
296 ± 2 K |
Number of distinct elements |
5 |
Space group number |
15 |
Hermann-Mauguin space group symbol |
C 1 2/c 1 |
Hall space group symbol |
-C 2yc |
Residual factor for all reflections |
0.0821 |
Residual factor for significantly intense reflections |
0.0618 |
Weighted residual factors for significantly intense reflections |
0.1951 |
Weighted residual factors for all reflections included in the refinement |
0.2084 |
Goodness-of-fit parameter for all reflections included in the refinement |
1.099 |
Diffraction radiation wavelength |
0.71073 Å |
Diffraction radiation type |
MoKα |
Yes |
Yes |
No |