Information card for entry 7226911
Formula | Cl2 Cs3 Fe H36 K4 O95 Si2 Ta6 W18 |
Calculated formula | Cl2 Cs4 Fe K4 O93 Si2 Ta6 W18 |
Title of publication | Self-assembly and photocatalytic properties of Ta/W mixed-addendum polyoxometalate and transition-metal cations |
Authors of publication | Huang, Peng; Han, Xi-Guang; Li, Xiu-Ling; Qin, Chao; Wang, Xin-Long; Su, Zhong-Min |
Journal of publication | CrystEngComm |
Year of publication | 2016 |
Journal volume | 18 |
Journal issue | 45 |
Pages of publication | 8722 |
a | 34.419 ± 0.005 Å |
b | 16.271 ± 0.005 Å |
c | 21.596 ± 0.005 Å |
α | 90 ± 0.005° |
β | 114.928 ± 0.005° |
γ | 90 ± 0.005° |
Cell volume | 10968 ± 5 Å3 |
Cell temperature | 298 ± 2 K |
Ambient diffraction temperature | 298.15 K |
Number of distinct elements | 9 |
Space group number | 12 |
Hermann-Mauguin space group symbol | C 1 2/m 1 |
Hall space group symbol | -C 2y |
Residual factor for all reflections | 0.0743 |
Residual factor for significantly intense reflections | 0.049 |
Weighted residual factors for significantly intense reflections | 0.1242 |
Weighted residual factors for all reflections included in the refinement | 0.1399 |
Goodness-of-fit parameter for all reflections included in the refinement | 1.02 |
Diffraction radiation wavelength | 0.71069 Å |
Diffraction radiation type | MoKα |