Information card for entry 7226974
Formula | C92 H114 N6 O28 Sr4 |
Calculated formula | C92 H114 N6 O28 Sr4 |
Title of publication | Dependence of the SBU length on the size of metal ions in alkaline earth MOFs derived from a flexible C3-symmetric tricarboxylic acid |
Authors of publication | Vishnoi, Pratap; Kaleeswaran, D.; Kalita, Alok Ch.; Murugavel, Ramaswamy |
Journal of publication | CrystEngComm |
Year of publication | 2016 |
Journal volume | 18 |
Journal issue | 47 |
Pages of publication | 9130 |
a | 16.331 ± 0.006 Å |
b | 19.681 ± 0.005 Å |
c | 21.132 ± 0.004 Å |
α | 59.93 ± 0.017° |
β | 71.32 ± 0.02° |
γ | 83.87 ± 0.02° |
Cell volume | 5556 ± 3 Å3 |
Cell temperature | 150 ± 2 K |
Ambient diffraction temperature | 150 ± 2 K |
Number of distinct elements | 5 |
Space group number | 2 |
Hermann-Mauguin space group symbol | P -1 |
Hall space group symbol | -P 1 |
Residual factor for all reflections | 0.1618 |
Residual factor for significantly intense reflections | 0.1064 |
Weighted residual factors for significantly intense reflections | 0.2324 |
Weighted residual factors for all reflections included in the refinement | 0.2687 |
Goodness-of-fit parameter for all reflections included in the refinement | 1.042 |
Diffraction radiation wavelength | 0.71075 Å |
Diffraction radiation type | MoKα |