Information card for entry 7227008
Chemical name | (N,N'-Dibromo-5,5-dimethylhydantoin)2(pyrazine) |
Formula | C7 H8 Br2 N3 O2 |
Calculated formula | C7 H8 Br2 N3 O2 |
Title of publication | Dibromohydantoins as halogen bond (XB) donors: a route toward the introduction of chirality in halogen bonded systems |
Authors of publication | Nicolas, Irène; Jeannin, Olivier; Pichon, Delphine; Fourmigué, Marc |
Journal of publication | CrystEngComm |
Year of publication | 2016 |
Journal volume | 18 |
Journal issue | 48 |
Pages of publication | 9325 |
a | 7.714 ± 0.0004 Å |
b | 8.0925 ± 0.0004 Å |
c | 9.1626 ± 0.0004 Å |
α | 64.045 ± 0.003° |
β | 81.55 ± 0.004° |
γ | 85.532 ± 0.004° |
Cell volume | 508.65 ± 0.04 Å3 |
Cell temperature | 150 ± 2 K |
Ambient diffraction temperature | 150 ± 2 K |
Number of distinct elements | 5 |
Space group number | 2 |
Hermann-Mauguin space group symbol | P -1 |
Hall space group symbol | -P 1 |
Residual factor for all reflections | 0.0357 |
Residual factor for significantly intense reflections | 0.0282 |
Weighted residual factors for significantly intense reflections | 0.075 |
Weighted residual factors for all reflections included in the refinement | 0.0775 |
Goodness-of-fit parameter for all reflections included in the refinement | 1.108 |
Diffraction radiation probe | x-ray |
Diffraction radiation wavelength | 0.71073 Å |
Diffraction radiation type | MoKα |