Information card for entry 7227015
Formula | C36 H34 Cu3 N4 O12 |
Calculated formula | C36 H34 Cu3 N4 O12 |
Title of publication | A series of bis(pyridyl)-bis(amide)-modulated metal-1,2-phenylenediacetate coordination polymers: construction and selective dye adsorption |
Authors of publication | Wang, Xiuli; Zhao, Jing; Le, Mao; Lin, Hongyan; Liu, Guocheng; Wang, Xiang |
Journal of publication | CrystEngComm |
Year of publication | 2016 |
Journal volume | 18 |
Journal issue | 48 |
Pages of publication | 9316 |
a | 5.7315 ± 0.0019 Å |
b | 8.915 ± 0.003 Å |
c | 18.554 ± 0.006 Å |
α | 76.76 ± 0.006° |
β | 81.312 ± 0.006° |
γ | 82.111 ± 0.006° |
Cell volume | 907 ± 0.5 Å3 |
Cell temperature | 296 ± 2 K |
Ambient diffraction temperature | 296 ± 2 K |
Number of distinct elements | 5 |
Space group number | 2 |
Hermann-Mauguin space group symbol | P -1 |
Hall space group symbol | -P 1 |
Residual factor for all reflections | 0.1066 |
Residual factor for significantly intense reflections | 0.0855 |
Weighted residual factors for significantly intense reflections | 0.2207 |
Weighted residual factors for all reflections included in the refinement | 0.2399 |
Goodness-of-fit parameter for all reflections included in the refinement | 1.019 |
Diffraction radiation wavelength | 0.71073 Å |
Diffraction radiation type | MoKα |