Information card for entry 7227024
Formula |
B6 Br0.25 Cl0.75 K3 O10 |
Calculated formula |
B6 Br0.254 Cl0.746 K3 O10 |
Title of publication |
Chemical engineering of mixed halide hexaborates as nonlinear optical materials |
Authors of publication |
Xia, Mingjun; Hou, Zhanyu; Yang, Yi; Xu, Bo; Liu, Lijuan; Wang, Xiaoyang; Lin, Zheshuai; Li, R.K.; Chen, Chuangtian |
Journal of publication |
RSC Adv. |
Year of publication |
2016 |
a |
10.0855 ± 0.0004 Å |
b |
10.0855 ± 0.0004 Å |
c |
8.8613 ± 0.0004 Å |
α |
90° |
β |
90° |
γ |
120° |
Cell volume |
780.59 ± 0.06 Å3 |
Cell temperature |
296 ± 2 K |
Ambient diffraction temperature |
296 ± 2 K |
Number of distinct elements |
5 |
Space group number |
160 |
Hermann-Mauguin space group symbol |
R 3 m :H |
Hall space group symbol |
R 3 -2" |
Residual factor for all reflections |
0.0139 |
Residual factor for significantly intense reflections |
0.0137 |
Weighted residual factors for significantly intense reflections |
0.0337 |
Weighted residual factors for all reflections included in the refinement |
0.0342 |
Goodness-of-fit parameter for all reflections included in the refinement |
1.119 |
Diffraction radiation wavelength |
0.71073 Å |
Diffraction radiation type |
MoKα |
Yes |
No |
No |