Information card for entry 7227054
Formula | C50 H30 N10 |
Calculated formula | C50 H30 N10 |
SMILES | C(#N)C(C#N)=C1C=CC(=C(C#N)C#N)C=C1.[n+]1(ccc2c(c1)cccc2)Cc1ccc(C[n+]2ccc3c(c2)cccc3)cc1.C(#N)C(C#N)=C1C=CC(C=C1)=C(C#N)C#N |
Title of publication | Structural and optical investigations of charge transfer complexes involving the radical anions of TCNQ and F4TCNQ |
Authors of publication | Sutton, Ashley L.; Abrahams, Brendan F.; D'Alessandro, Deanna M.; Hudson, Timothy A.; Robson, Richard; Usov, Pavel M. |
Journal of publication | CrystEngComm |
Year of publication | 2016 |
Journal volume | 18 |
Journal issue | 46 |
Pages of publication | 8906 |
a | 7.7053 ± 0.0005 Å |
b | 10.2744 ± 0.0007 Å |
c | 12.1391 ± 0.0009 Å |
α | 90.196 ± 0.006° |
β | 97.753 ± 0.006° |
γ | 97.1 ± 0.006° |
Cell volume | 944.74 ± 0.11 Å3 |
Cell temperature | 130 ± 2 K |
Ambient diffraction temperature | 130.01 ± 0.1 K |
Number of distinct elements | 3 |
Space group number | 2 |
Hermann-Mauguin space group symbol | P -1 |
Hall space group symbol | -P 1 |
Residual factor for all reflections | 0.0594 |
Residual factor for significantly intense reflections | 0.046 |
Weighted residual factors for significantly intense reflections | 0.1203 |
Weighted residual factors for all reflections included in the refinement | 0.1313 |
Goodness-of-fit parameter for all reflections included in the refinement | 1.01 |
Diffraction radiation wavelength | 1.5418 Å |
Diffraction radiation type | CuKα |