Information card for entry 7227056
Formula | C102 H87 Br4 Co5 N26 O11.5 |
Calculated formula | C102 H80 Br4 Co5 N26 O8 |
Title of publication | Metal-responsive activation of C‒O and C‒C bonds of an aromatic vicinal diol in hydrothermal conditions: synthesis, structure, mechanism and magnetic properties |
Authors of publication | Feng, S. S.; Zheng, J. F.; Lu, L. P.; Lu, H. G.; Gao, Z. Q.; Dong, Y. H. |
Journal of publication | CrystEngComm |
Year of publication | 2016 |
Journal volume | 18 |
Journal issue | 47 |
Pages of publication | 9077 |
a | 41.0956 ± 0.0015 Å |
b | 24.8982 ± 0.0009 Å |
c | 28.2361 ± 0.0011 Å |
α | 90° |
β | 104.629 ± 0.002° |
γ | 90° |
Cell volume | 27954.7 ± 1.8 Å3 |
Cell temperature | 123 ± 2 K |
Ambient diffraction temperature | 123 ± 2 K |
Number of distinct elements | 6 |
Space group number | 15 |
Hermann-Mauguin space group symbol | C 1 2/c 1 |
Hall space group symbol | -C 2yc |
Residual factor for all reflections | 0.2717 |
Residual factor for significantly intense reflections | 0.11 |
Weighted residual factors for significantly intense reflections | 0.261 |
Weighted residual factors for all reflections included in the refinement | 0.3578 |
Goodness-of-fit parameter for all reflections included in the refinement | 0.96 |
Diffraction radiation wavelength | 0.71073 Å |
Diffraction radiation type | MoKα |