Information card for entry 7227082
Formula | C44 H32 Dy2 N4 O17.9 S4 |
Calculated formula | C44 H32 Dy2 N4 O17.9049 S4 |
Title of publication | Luminescence, Chemical Sensing and Mechanical Properties of Crystalline Materials Based on Lanthanide-Sulfonate Coordination Polymers |
Authors of publication | D'Vries, Richard Fernando; Gómez, Germán; Lionello, Diego E.; Fuertes, Cecilia; Soler-Illia, Galo; Ellena, Javier A. |
Journal of publication | RSC Adv. |
Year of publication | 2016 |
a | 14.2586 ± 0.0006 Å |
b | 17.0438 ± 0.0007 Å |
c | 18.9287 ± 0.0007 Å |
α | 90° |
β | 99.071 ± 0.001° |
γ | 90° |
Cell volume | 4542.5 ± 0.3 Å3 |
Cell temperature | 296 ± 2 K |
Ambient diffraction temperature | 296.15 K |
Number of distinct elements | 6 |
Space group number | 14 |
Hermann-Mauguin space group symbol | P 1 21/n 1 |
Hall space group symbol | -P 2yn |
Residual factor for all reflections | 0.0627 |
Residual factor for significantly intense reflections | 0.0361 |
Weighted residual factors for significantly intense reflections | 0.0751 |
Weighted residual factors for all reflections included in the refinement | 0.087 |
Goodness-of-fit parameter for all reflections included in the refinement | 1.034 |
Diffraction radiation probe | x-ray |
Diffraction radiation wavelength | 0.71073 Å |
Diffraction radiation type | MoKα |