Information card for entry 7227099
Formula | C24 H20 Mn N2 O8 |
Calculated formula | C24 H20 Mn N2 O8 |
Title of publication | Structural diversity of Mn(ii), Zn(ii) and Pb(ii) coordination polymers constructed from isomeric pyridylbenzoate N-oxide ligands: structures and electrochemical properties |
Authors of publication | Hu, Lei; Lin, Xiao-Ming; Lin, Jia; Zhang, Ru-Qiao; Zhang, Da-Liang; Cai, Yue-Peng |
Journal of publication | CrystEngComm |
Year of publication | 2016 |
Journal volume | 18 |
Journal issue | 48 |
Pages of publication | 9307 |
a | 10.048 ± 0.003 Å |
b | 20.458 ± 0.005 Å |
c | 10.462 ± 0.003 Å |
α | 90° |
β | 92.797 ± 0.005° |
γ | 90° |
Cell volume | 2148 ± 1 Å3 |
Cell temperature | 296 ± 2 K |
Ambient diffraction temperature | 296 ± 2 K |
Number of distinct elements | 5 |
Space group number | 14 |
Hermann-Mauguin space group symbol | P 1 21/c 1 |
Hall space group symbol | -P 2ybc |
Residual factor for all reflections | 0.0862 |
Residual factor for significantly intense reflections | 0.059 |
Weighted residual factors for significantly intense reflections | 0.129 |
Weighted residual factors for all reflections included in the refinement | 0.149 |
Goodness-of-fit parameter for all reflections included in the refinement | 1.022 |
Diffraction radiation wavelength | 0.71073 Å |
Diffraction radiation type | MoKα |