Information card for entry 7227103
Formula | C24 H20 N2 O8 Zn |
Calculated formula | C24 H16 N2 O8 Zn |
Title of publication | Structural diversity of Mn(ii), Zn(ii) and Pb(ii) coordination polymers constructed from isomeric pyridylbenzoate N-oxide ligands: structures and electrochemical properties |
Authors of publication | Hu, Lei; Lin, Xiao-Ming; Lin, Jia; Zhang, Ru-Qiao; Zhang, Da-Liang; Cai, Yue-Peng |
Journal of publication | CrystEngComm |
Year of publication | 2016 |
Journal volume | 18 |
Journal issue | 48 |
Pages of publication | 9307 |
a | 21.133 ± 0.008 Å |
b | 7.397 ± 0.003 Å |
c | 15.679 ± 0.006 Å |
α | 90° |
β | 118.019 ± 0.007° |
γ | 90° |
Cell volume | 2163.7 ± 1.5 Å3 |
Cell temperature | 296 ± 2 K |
Ambient diffraction temperature | 296 ± 2 K |
Number of distinct elements | 5 |
Space group number | 5 |
Hermann-Mauguin space group symbol | C 1 2 1 |
Hall space group symbol | C 2y |
Residual factor for all reflections | 0.1168 |
Residual factor for significantly intense reflections | 0.0906 |
Weighted residual factors for significantly intense reflections | 0.2572 |
Weighted residual factors for all reflections included in the refinement | 0.2743 |
Goodness-of-fit parameter for all reflections included in the refinement | 1.068 |
Diffraction radiation wavelength | 0.71073 Å |
Diffraction radiation type | MoKα |