Information card for entry 7227133
Common name | CIH065R |
Formula | C18 H18 N2 O4 Zn |
Calculated formula | C18 H18 N2 O4 Zn |
Title of publication | Zn-MOFs containing flexible α,ω-alkane (or alkene)-dicarboxylates with 1,2-bis(4-pyridyl)ethylene: comparison with Zn-MOFs containing 1,2-bis(4-pyridyl)ethane ligands |
Authors of publication | Kim, Hyun-Chul; Huh, Seong; Kim, Jin Yeong; Moon, Hoi Ri; Lee, Do Nam; Kim, Youngmee |
Journal of publication | CrystEngComm |
Year of publication | 2017 |
Journal volume | 19 |
Journal issue | 1 |
Pages of publication | 99 |
a | 8.1425 ± 0.0002 Å |
b | 9.1496 ± 0.0002 Å |
c | 11.5118 ± 0.0003 Å |
α | 97.185 ± 0.0016° |
β | 96.2776 ± 0.0017° |
γ | 102.745 ± 0.0016° |
Cell volume | 821.58 ± 0.04 Å3 |
Cell temperature | 296 ± 2 K |
Ambient diffraction temperature | 296 ± 2 K |
Number of distinct elements | 5 |
Space group number | 2 |
Hermann-Mauguin space group symbol | P -1 |
Hall space group symbol | -P 1 |
Residual factor for all reflections | 0.0892 |
Residual factor for significantly intense reflections | 0.065 |
Weighted residual factors for significantly intense reflections | 0.1444 |
Weighted residual factors for all reflections included in the refinement | 0.159 |
Goodness-of-fit parameter for all reflections included in the refinement | 1.041 |
Diffraction radiation wavelength | 0.71073 Å |