Information card for entry 7227135
Formula | C16 H12 N2 O4 Zn |
Calculated formula | C16 H12 N2 O4 Zn |
Title of publication | Zn-MOFs containing flexible α,ω-alkane (or alkene)-dicarboxylates with 1,2-bis(4-pyridyl)ethylene: comparison with Zn-MOFs containing 1,2-bis(4-pyridyl)ethane ligands |
Authors of publication | Kim, Hyun-Chul; Huh, Seong; Kim, Jin Yeong; Moon, Hoi Ri; Lee, Do Nam; Kim, Youngmee |
Journal of publication | CrystEngComm |
Year of publication | 2017 |
Journal volume | 19 |
Journal issue | 1 |
Pages of publication | 99 |
a | 8.8583 ± 0.0002 Å |
b | 21.437 ± 0.0005 Å |
c | 13.5925 ± 0.0003 Å |
α | 90° |
β | 95.7932 ± 0.0012° |
γ | 90° |
Cell volume | 2567.97 ± 0.1 Å3 |
Cell temperature | 296 ± 2 K |
Ambient diffraction temperature | 296 ± 2 K |
Number of distinct elements | 5 |
Space group number | 15 |
Hermann-Mauguin space group symbol | C 1 2/c 1 |
Hall space group symbol | -C 2yc |
Residual factor for all reflections | 0.0549 |
Residual factor for significantly intense reflections | 0.0412 |
Weighted residual factors for significantly intense reflections | 0.0899 |
Weighted residual factors for all reflections included in the refinement | 0.0934 |
Goodness-of-fit parameter for all reflections included in the refinement | 1.137 |
Diffraction radiation wavelength | 0.71073 Å |
Diffraction radiation type | MoKα |