Information card for entry 7227559
Formula | C72 H50 I6 Lu2 N6 O14 |
Calculated formula | C72 H50 I6 Lu2 N6 O14 |
Title of publication | RE-p-halobenzoic acid‒terpyridine complexes, part III: structural and supramolecular trends in a series of p-iodobenzoic acid rare-earth hybrid materials |
Authors of publication | August Ridenour, J.; Carter, Korey P.; Cahill, Christopher L. |
Journal of publication | CrystEngComm |
Year of publication | 2017 |
Journal volume | 19 |
Journal issue | 8 |
Pages of publication | 1190 |
a | 11.1864 ± 0.0009 Å |
b | 12.786 ± 0.0007 Å |
c | 14.4367 ± 0.0008 Å |
α | 68.885 ± 0.001° |
β | 88.375 ± 0.003° |
γ | 72.644 ± 0.002° |
Cell volume | 1831.3 ± 0.2 Å3 |
Cell temperature | 293 ± 2 K |
Ambient diffraction temperature | 293 K |
Number of distinct elements | 6 |
Space group number | 2 |
Hermann-Mauguin space group symbol | P -1 |
Hall space group symbol | -P 1 |
Residual factor for all reflections | 0.0446 |
Residual factor for significantly intense reflections | 0.0363 |
Weighted residual factors for significantly intense reflections | 0.0973 |
Weighted residual factors for all reflections included in the refinement | 0.1033 |
Goodness-of-fit parameter for all reflections included in the refinement | 1.038 |
Diffraction radiation probe | x-ray |
Diffraction radiation wavelength | 0.71073 Å |
Diffraction radiation type | MoKα |