Information card for entry 7227674
Formula | C27 H39 N3 O9 |
Calculated formula | C27 H39 N3 O9 |
Title of publication | Benzene-1,3,5-tricarboxamide n-alkyl ester and carboxylic acid derivatives: tuneable structural, morphological and thermal properties |
Authors of publication | Lynes, Amy D.; Hawes, Chris S.; Ward, Edward N.; Haffner, Benjamin; Möbius, Matthias E.; Byrne, Kevin; Schmitt, Wolfgang; Pal, Robert; Gunnlaugsson, Thorfinnur |
Journal of publication | CrystEngComm |
Year of publication | 2017 |
Journal volume | 19 |
Journal issue | 10 |
Pages of publication | 1427 |
a | 15.5682 ± 0.0006 Å |
b | 15.5682 ± 0.0006 Å |
c | 6.8268 ± 0.0003 Å |
α | 90° |
β | 90° |
γ | 120° |
Cell volume | 1432.93 ± 0.1 Å3 |
Cell temperature | 100 ± 2 K |
Ambient diffraction temperature | 99.99 K |
Number of distinct elements | 4 |
Space group number | 176 |
Hermann-Mauguin space group symbol | P 63/m |
Hall space group symbol | -P 6c |
Residual factor for all reflections | 0.0615 |
Residual factor for significantly intense reflections | 0.0533 |
Weighted residual factors for significantly intense reflections | 0.1608 |
Weighted residual factors for all reflections included in the refinement | 0.1674 |
Goodness-of-fit parameter for all reflections included in the refinement | 1.064 |
Diffraction radiation wavelength | 1.54178 Å |
Diffraction radiation type | CuKα |