Information card for entry 7227699
Formula | C46 H28 Cl2 Fe2 N8 Se2 |
Calculated formula | C46 H28 Cl2 Fe2 N8 Se2 |
Title of publication | Valence engineering of ionic molecular crystals: monovalent‒divalent phase diagram for biferrocene‒tetracyanoquinodimethane salts |
Authors of publication | Mochida, Tomoyuki; Funasako, Yusuke; Akasaka, Takahiro; Uruichi, Mikio; Mori, Hatsumi |
Journal of publication | CrystEngComm |
Year of publication | 2017 |
Journal volume | 19 |
Journal issue | 11 |
Pages of publication | 1449 |
a | 8.77 ± 0.0012 Å |
b | 9.211 ± 0.0012 Å |
c | 13.5822 ± 0.0019 Å |
α | 89.993 ± 0.003° |
β | 75.599 ± 0.003° |
γ | 71.823 ± 0.003° |
Cell volume | 1006.1 ± 0.2 Å3 |
Cell temperature | 173 K |
Ambient diffraction temperature | 173 K |
Number of distinct elements | 6 |
Space group number | 2 |
Hermann-Mauguin space group symbol | P -1 |
Hall space group symbol | -P 1 |
Residual factor for all reflections | 0.1001 |
Residual factor for significantly intense reflections | 0.0599 |
Weighted residual factors for significantly intense reflections | 0.1526 |
Weighted residual factors for all reflections included in the refinement | 0.1787 |
Goodness-of-fit parameter for all reflections included in the refinement | 1.059 |
Diffraction radiation wavelength | 0.71073 Å |
Diffraction radiation type | MoKα |