Information card for entry 7227860
Chemical name | Poly{[triaqua(mu-6-aminopyridine-3-carboxylato-kN:kO)(6-aminopyridine-3-carboxylato-kO')cobalt(II)]dihydrate} |
Formula | C12 H20 Co N4 O9 |
Calculated formula | C12 H20 Co N4 O9 |
Title of publication | From isolated to 2D coordination polymers based on 6-aminonicotinate and 3d-metal ions: towards field-induced single-ion-magnets |
Authors of publication | Rodríguez-Diéguez, Antonio; Pérez-Yáñez, Sonia; Ruiz-Rubio, Leire; Seco, Jose M.; Cepeda, Javier |
Journal of publication | CrystEngComm |
Year of publication | 2017 |
Journal volume | 19 |
Journal issue | 16 |
Pages of publication | 2229 |
a | 11.895 ± 0.0005 Å |
b | 7.3902 ± 0.0002 Å |
c | 18.7683 ± 0.0005 Å |
α | 90° |
β | 90° |
γ | 90° |
Cell volume | 1649.85 ± 0.09 Å3 |
Cell temperature | 100 ± 2 K |
Ambient diffraction temperature | 100 ± 2 K |
Number of distinct elements | 5 |
Space group number | 19 |
Hermann-Mauguin space group symbol | P 21 21 21 |
Hall space group symbol | P 2ac 2ab |
Residual factor for all reflections | 0.0393 |
Residual factor for significantly intense reflections | 0.0334 |
Weighted residual factors for significantly intense reflections | 0.069 |
Weighted residual factors for all reflections included in the refinement | 0.0726 |
Goodness-of-fit parameter for all reflections included in the refinement | 1.035 |
Diffraction radiation wavelength | 0.71073 Å |
Diffraction radiation type | MoKα |