Information card for entry 7227952
Formula | C38 H27 Cd2 N5 O9 |
Calculated formula | C38 H27 Cd2 N5 O9 |
Title of publication | Five new 2D and 3D coordination polymers based on two new multifunctional pyridyl‒tricarboxylate ligands: hydrothermal syntheses, structural diversity, luminescent and magnetic properties |
Authors of publication | Guo, Xiao-Yu; Zhao, Fei; Liu, Hou-Ting; Wang, Yan-Qin; Liu, Zhi-Liang; Gao, En-Qing |
Journal of publication | RSC Adv. |
Year of publication | 2017 |
Journal volume | 7 |
Journal issue | 31 |
Pages of publication | 19039 |
a | 11.8521 ± 0.0011 Å |
b | 12.22 ± 0.0012 Å |
c | 14.6694 ± 0.0015 Å |
α | 68.971 ± 0.009° |
β | 68.595 ± 0.009° |
γ | 61.417 ± 0.01° |
Cell volume | 1692.3 ± 0.3 Å3 |
Cell temperature | 293 ± 2 K |
Ambient diffraction temperature | 293 ± 2 K |
Number of distinct elements | 5 |
Space group number | 2 |
Hermann-Mauguin space group symbol | P -1 |
Hall space group symbol | -P 1 |
Residual factor for all reflections | 0.0891 |
Residual factor for significantly intense reflections | 0.0546 |
Weighted residual factors for significantly intense reflections | 0.0973 |
Weighted residual factors for all reflections included in the refinement | 0.1248 |
Goodness-of-fit parameter for all reflections included in the refinement | 1.035 |
Diffraction radiation wavelength | 0.71073 Å |
Diffraction radiation type | MoKα |