Information card for entry 7228174
Common name | Co(B-Et)2 |
Formula | C24 H28 Co N2 O2 |
Calculated formula | C24 H28 Co N2 O2 |
SMILES | [Co]12([N](=C(C=C(O1)c1ccccc1)C)CC)[N](=C(C=C(O2)c1ccccc1)C)CC |
Title of publication | Interrelationships between the tetrahedral and planar polymorphs of bis(3-ethylamino-1-phenyl-but-2-en-1-ono)nickel(ii) and structural comparisons with related CoII, NiII, CuII, and ZnII complexes |
Authors of publication | Powers, Xian B.; Ghiassi, Kamran B.; Greenfield, Joshua T.; Olmstead, Marilyn M.; Balch, Alan L. |
Journal of publication | CrystEngComm |
Year of publication | 2017 |
a | 12.6021 ± 0.0017 Å |
b | 13.2685 ± 0.0018 Å |
c | 14.856 ± 0.002 Å |
α | 102.934 ± 0.002° |
β | 94.203 ± 0.002° |
γ | 117.933 ± 0.0018° |
Cell volume | 2092.7 ± 0.5 Å3 |
Cell temperature | 90 ± 2 K |
Ambient diffraction temperature | 90 ± 2 K |
Number of distinct elements | 5 |
Space group number | 2 |
Hermann-Mauguin space group symbol | P -1 |
Hall space group symbol | -P 1 |
Residual factor for all reflections | 0.0798 |
Residual factor for significantly intense reflections | 0.0478 |
Weighted residual factors for significantly intense reflections | 0.1093 |
Weighted residual factors for all reflections included in the refinement | 0.1249 |
Goodness-of-fit parameter for all reflections included in the refinement | 1.039 |
Diffraction radiation wavelength | 0.71073 Å |
Diffraction radiation type | MoKα |