Information card for entry 7228667
Formula |
C13 H10 Cl N O2 |
Calculated formula |
C13 H10 Cl N O2 |
SMILES |
Clc1ccc(c(c1)Nc1ccccc1)C(=O)O |
Title of publication |
sp2CH…Cl Hydrogen Bond in the Conformational Polymorphism of 4-Chloro-phenylanthranilic acid |
Authors of publication |
Liu, Meng; Yin, Chuming; Chen, Peng; Zhang, Mingtao; Parkin, Sean R.; Zhou, Panpan; Li, Tonglei; Yu, Faquan; Long, Sihui |
Journal of publication |
CrystEngComm |
Year of publication |
2017 |
a |
8.2249 ± 0.0002 Å |
b |
10.1269 ± 0.0003 Å |
c |
13.7993 ± 0.0004 Å |
α |
88.2266 ± 0.0011° |
β |
85.954 ± 0.0011° |
γ |
81.4168 ± 0.0011° |
Cell volume |
1133.43 ± 0.05 Å3 |
Cell temperature |
90 ± 0.2 K |
Ambient diffraction temperature |
90 ± 0.2 K |
Number of distinct elements |
5 |
Space group number |
2 |
Hermann-Mauguin space group symbol |
P -1 |
Hall space group symbol |
-P 1 |
Residual factor for all reflections |
0.0908 |
Residual factor for significantly intense reflections |
0.0433 |
Weighted residual factors for significantly intense reflections |
0.0853 |
Weighted residual factors for all reflections included in the refinement |
0.0993 |
Goodness-of-fit parameter for all reflections included in the refinement |
0.986 |
Diffraction radiation wavelength |
0.71073 Å |
Diffraction radiation type |
MoKα |
Yes |
No |
No |