Information card for entry 7228861
Common name | 6-Methyl Dianin's compound |
Chemical name | p-Hydroxyphenyl-2,2,4,6-tetramethylchroman |
Formula | C19 H22 O2 |
Calculated formula | C19 H22 O2 |
SMILES | O1C(CC(c2cc(C)ccc12)(c1ccc(O)cc1)C)(C)C |
Title of publication | Total CCl4 guest alignment in a quasiracemic clathrate closely related to Dianin’s compound |
Authors of publication | Frampton, Christopher Stephen; Gall, James H.; MacNicol, David D. |
Journal of publication | CrystEngComm |
Year of publication | 2017 |
a | 14.14913 ± 0.00016 Å |
b | 6.42088 ± 0.00006 Å |
c | 18.3566 ± 0.0002 Å |
α | 90° |
β | 111.973 ± 0.0013° |
γ | 90° |
Cell volume | 1546.55 ± 0.03 Å3 |
Cell temperature | 100 ± 1 K |
Ambient diffraction temperature | 100 ± 1 K |
Number of distinct elements | 3 |
Space group number | 14 |
Hermann-Mauguin space group symbol | P 1 21/n 1 |
Hall space group symbol | -P 2yn |
Residual factor for all reflections | 0.0378 |
Residual factor for significantly intense reflections | 0.0355 |
Weighted residual factors for significantly intense reflections | 0.0914 |
Weighted residual factors for all reflections included in the refinement | 0.0934 |
Goodness-of-fit parameter for all reflections included in the refinement | 1.019 |
Diffraction radiation wavelength | 1.54184 Å |
Diffraction radiation type | CuKα |