Information card for entry 7228984
Formula | C69 H99 Cl6 N O3 Ti3 |
Calculated formula | C69 H99 Cl6 N O3 Ti3 |
SMILES | [Ti]1234(Cl)(Cl)(Oc5c(CN(Cc6c(O[Ti]789%10(Cl)(Cl)[c]%11([c]%10([cH]9[c]8([cH]7%11)C)C)C)c(cc(c6)C(C)(C)C)C(C)(C)C)Cc6c(O[Ti]789%10(Cl)(Cl)[c]%11([c]%10([cH]9[c]8([cH]7%11)C)C)C)c(cc(c6)C(C)(C)C)C(C)(C)C)cc(cc5C(C)(C)C)C(C)(C)C)[c]5([cH]1[c]2([c]3([cH]45)C)C)C |
Title of publication | Synthesis and structural analysis of aryloxo-modified trinuclear half-titanocenes, and their use as catalyst precursors for ethylene polymerisation |
Authors of publication | Yan, Qing; Tsutsumi, Ken; Nomura, Kotohiro |
Journal of publication | RSC Adv. |
Year of publication | 2017 |
Journal volume | 7 |
Journal issue | 66 |
Pages of publication | 41345 |
a | 13.2258 ± 0.0006 Å |
b | 22.4804 ± 0.0011 Å |
c | 24.4338 ± 0.0012 Å |
α | 90° |
β | 99.642 ± 0.004° |
γ | 90° |
Cell volume | 7162.1 ± 0.6 Å3 |
Cell temperature | 93 K |
Ambient diffraction temperature | 93 K |
Number of distinct elements | 6 |
Space group number | 14 |
Hermann-Mauguin space group symbol | P 1 21/n 1 |
Hall space group symbol | -P 2yn |
Residual factor for all reflections | 0.1132 |
Residual factor for significantly intense reflections | 0.0571 |
Weighted residual factors for significantly intense reflections | 0.1101 |
Weighted residual factors for all reflections included in the refinement | 0.133 |
Goodness-of-fit parameter for all reflections included in the refinement | 1.012 |
Diffraction radiation wavelength | 0.71073 Å |
Diffraction radiation type | MoKα |