Information card for entry 7228998
Formula | C26 H80 Cl3 O22 P4 Sm |
Calculated formula | C26 H80 Cl3 O22 P4 Sm |
SMILES | [Sm]12([O]=P(OC(C)C)(OC(C)C)CP(=[O]1)(OC(C)C)OC(C)C)([O]=P(OC(C)C)(OC(C)C)CP(=[O]2)(OC(C)C)OC(C)C)([OH2])([OH2])([OH2])[OH2].[Cl-].[Cl-].[Cl-].O.O.O.O.O.O |
Title of publication | Lanthanide contraction and chelating effect on a new family of lanthanide complexes with tetrakis(O-isopropyl)methyle-nediphosphonate: synthesis, structures and terahertz time-domain spectroscopy |
Authors of publication | Ma, Yan; Yang, Yong-Sheng; Jiang, Yu-Han; Li, Yue-Xue; Liu, Min; Li, Zhong-Feng; Han, Hong-Liang; Yang, Yu-Ping; Xin, Xiu-Lan; Jin, Qiong-Hua |
Journal of publication | RSC Adv. |
Year of publication | 2017 |
Journal volume | 7 |
Journal issue | 66 |
Pages of publication | 41651 |
a | 10.369 ± 0.001 Å |
b | 15.2349 ± 0.0014 Å |
c | 18.6571 ± 0.0016 Å |
α | 85.598 ± 0.002° |
β | 82.486 ± 0.001° |
γ | 76.306 ± 0.001° |
Cell volume | 2835.7 ± 0.4 Å3 |
Cell temperature | 298 ± 2 K |
Ambient diffraction temperature | 298 ± 2 K |
Number of distinct elements | 6 |
Space group number | 2 |
Hermann-Mauguin space group symbol | P -1 |
Hall space group symbol | -P 1 |
Residual factor for all reflections | 0.061 |
Residual factor for significantly intense reflections | 0.0431 |
Weighted residual factors for significantly intense reflections | 0.1182 |
Weighted residual factors for all reflections included in the refinement | 0.1307 |
Goodness-of-fit parameter for all reflections included in the refinement | 1.116 |
Diffraction radiation wavelength | 0.71073 Å |
Diffraction radiation type | MoKα |