Information card for entry 7229003
Formula | C26 H68 Cl3 La O16 P4 |
Calculated formula | C26 H68 Cl3 La O16 P4 |
SMILES | [La]12(Cl)([O]=P(OC(C)C)(OC(C)C)CP(=[O]1)(OC(C)C)OC(C)C)([O]=P(OC(C)C)(OC(C)C)CP(=[O]2)(OC(C)C)OC(C)C)([OH2])([OH2])([OH2])[OH2].[Cl-].[Cl-] |
Title of publication | Lanthanide contraction and chelating effect on a new family of lanthanide complexes with tetrakis(O-isopropyl)methyle-nediphosphonate: synthesis, structures and terahertz time-domain spectroscopy |
Authors of publication | Ma, Yan; Yang, Yong-Sheng; Jiang, Yu-Han; Li, Yue-Xue; Liu, Min; Li, Zhong-Feng; Han, Hong-Liang; Yang, Yu-Ping; Xin, Xiu-Lan; Jin, Qiong-Hua |
Journal of publication | RSC Adv. |
Year of publication | 2017 |
Journal volume | 7 |
Journal issue | 66 |
Pages of publication | 41651 |
a | 13.8 ± 0.0012 Å |
b | 16.7321 ± 0.0014 Å |
c | 22.43 ± 0.002 Å |
α | 107.433 ± 0.002° |
β | 97.103 ± 0.001° |
γ | 98.8 ± 0.001° |
Cell volume | 4803.6 ± 0.7 Å3 |
Cell temperature | 298 ± 2 K |
Ambient diffraction temperature | 298 ± 2 K |
Number of distinct elements | 6 |
Space group number | 2 |
Hermann-Mauguin space group symbol | P -1 |
Hall space group symbol | -P 1 |
Residual factor for all reflections | 0.1131 |
Residual factor for significantly intense reflections | 0.0397 |
Weighted residual factors for significantly intense reflections | 0.0886 |
Weighted residual factors for all reflections included in the refinement | 0.1402 |
Goodness-of-fit parameter for all reflections included in the refinement | 1.016 |
Diffraction radiation wavelength | 0.71073 Å |
Diffraction radiation type | MoKα |