Information card for entry 7229015
Formula | C63 H90 N2 O4.5 Zn2 |
Calculated formula | C63 H88 N2 O4.5 Zn2 |
Title of publication | Zinc bimetallics supported by a xanthene-bridged dinucleating ligand: synthesis, characterization, and lactide polymerization studies |
Authors of publication | Hollingsworth, Thilini S.; Hollingsworth, Ryan L.; Rosen, Tomer; Groysman, Stanislav |
Journal of publication | RSC Adv. |
Year of publication | 2017 |
Journal volume | 7 |
Journal issue | 66 |
Pages of publication | 41819 |
a | 14.0422 ± 0.0016 Å |
b | 14.7543 ± 0.0018 Å |
c | 16.4069 ± 0.0019 Å |
α | 94.571 ± 0.006° |
β | 107.133 ± 0.005° |
γ | 106.102 ± 0.005° |
Cell volume | 3072.3 ± 0.6 Å3 |
Cell temperature | 100 ± 2 K |
Ambient diffraction temperature | 100 ± 2 K |
Number of distinct elements | 5 |
Space group number | 2 |
Hermann-Mauguin space group symbol | P -1 |
Hall space group symbol | -P 1 |
Residual factor for all reflections | 0.1316 |
Residual factor for significantly intense reflections | 0.061 |
Weighted residual factors for significantly intense reflections | 0.1532 |
Weighted residual factors for all reflections included in the refinement | 0.1705 |
Goodness-of-fit parameter for all reflections included in the refinement | 0.961 |
Diffraction radiation wavelength | 0.71073 Å |
Diffraction radiation type | MoKα |