Information card for entry 7229022
Formula | C36 H34 N4 O |
Calculated formula | C36 H34 N4 O |
Title of publication | Mechanofluorochromic properties of fluorescent molecules based on a dicyanomethylene-4H-pyran and indole isomer containing different alkyl chains via an alkene module |
Authors of publication | Qian, Lebin; Zhou, Yibin; Liu, Miaochang; Huang, Xiaobo; Wu, Ge; Gao, Wenxia; Ding, Jinchang; Wu, Huayue |
Journal of publication | RSC Adv. |
Year of publication | 2017 |
Journal volume | 7 |
Journal issue | 67 |
Pages of publication | 42180 |
a | 19.03 ± 0.003 Å |
b | 21.991 ± 0.003 Å |
c | 9.8034 ± 0.0012 Å |
α | 90° |
β | 102.551 ± 0.007° |
γ | 90° |
Cell volume | 4004.6 ± 1 Å3 |
Cell temperature | 296 ± 2 K |
Ambient diffraction temperature | 296 K |
Number of distinct elements | 4 |
Space group number | 14 |
Hermann-Mauguin space group symbol | P 1 21/c 1 |
Hall space group symbol | -P 2ybc |
Residual factor for all reflections | 0.1414 |
Residual factor for significantly intense reflections | 0.0978 |
Weighted residual factors for significantly intense reflections | 0.2622 |
Weighted residual factors for all reflections included in the refinement | 0.3153 |
Goodness-of-fit parameter for all reflections included in the refinement | 0.95 |
Diffraction radiation wavelength | 1.54178 Å |
Diffraction radiation type | CuKα |