Information card for entry 7229285
Formula | C25 H17 N |
Calculated formula | C25 H17 N |
SMILES | C(#N)/C=C(c1ccccc1)/C(=C/c1ccccc1)C#Cc1ccccc1 |
Title of publication | Synthesis of functionalized unsymmetrical 1,3-butadiene-3-yne derivatives from β-halo styrene derivatives and their application in the synthesis of trisubstituted pyridines |
Authors of publication | Bandi, Vijayalakshmi; Kavala, Veerababurao; Hsu, Che-Hao; Konala, Ashok; Villuri, Bharath Kumar; Kotipalli, Trimurtulu; Kuo, Chun-Wei; Yao, Ching-Fa |
Journal of publication | RSC Adv. |
Year of publication | 2017 |
Journal volume | 7 |
Journal issue | 74 |
Pages of publication | 46704 |
a | 13.773 ± 0.003 Å |
b | 7.1192 ± 0.0014 Å |
c | 19.135 ± 0.004 Å |
α | 90° |
β | 96.972 ± 0.004° |
γ | 90° |
Cell volume | 1862.4 ± 0.7 Å3 |
Cell temperature | 200 ± 2 K |
Ambient diffraction temperature | 200 ± 2 K |
Number of distinct elements | 3 |
Space group number | 14 |
Hermann-Mauguin space group symbol | P 1 21/n 1 |
Hall space group symbol | -P 2yn |
Residual factor for all reflections | 0.0938 |
Residual factor for significantly intense reflections | 0.046 |
Weighted residual factors for significantly intense reflections | 0.0958 |
Weighted residual factors for all reflections included in the refinement | 0.1114 |
Goodness-of-fit parameter for all reflections included in the refinement | 0.989 |
Diffraction radiation wavelength | 0.71073 Å |
Diffraction radiation type | MoKα |