Information card for entry 7229288
Formula | C25 H17 N |
Calculated formula | C25 H17 N |
Title of publication | Synthesis of functionalized unsymmetrical 1,3-butadiene-3-yne derivatives from β-halo styrene derivatives and their application in the synthesis of trisubstituted pyridines |
Authors of publication | Bandi, Vijayalakshmi; Kavala, Veerababurao; Hsu, Che-Hao; Konala, Ashok; Villuri, Bharath Kumar; Kotipalli, Trimurtulu; Kuo, Chun-Wei; Yao, Ching-Fa |
Journal of publication | RSC Adv. |
Year of publication | 2017 |
Journal volume | 7 |
Journal issue | 74 |
Pages of publication | 46704 |
a | 22.492 ± 0.003 Å |
b | 3.945 ± 0.0005 Å |
c | 20.893 ± 0.003 Å |
α | 90° |
β | 112.82 ± 0.009° |
γ | 90° |
Cell volume | 1708.8 ± 0.4 Å3 |
Cell temperature | 200 ± 2 K |
Ambient diffraction temperature | 200 ± 2 K |
Number of distinct elements | 3 |
Space group number | 13 |
Hermann-Mauguin space group symbol | P 1 2/c 1 |
Hall space group symbol | -P 2yc |
Residual factor for all reflections | 0.1852 |
Residual factor for significantly intense reflections | 0.0943 |
Weighted residual factors for significantly intense reflections | 0.2358 |
Weighted residual factors for all reflections included in the refinement | 0.2966 |
Goodness-of-fit parameter for all reflections included in the refinement | 1.043 |
Diffraction radiation wavelength | 0.71073 Å |
Diffraction radiation type | MoKα |