Information card for entry 7229418
Formula | C6 H6 Co N8 O4 |
Calculated formula | C6 H6 Co N8 O4 |
Title of publication | The diversities of magnetic behaviors appearing simultaneously in three isomorphs based on 1H-tetrazolyl-acetic acid ligand |
Authors of publication | Yan, Tong; Du, Lin; Sun, Lin; Zhang, Xiao-Feng; Wang, Tao; Feng, Jing; Zhou, Jie; Zhao, Qi-Hua |
Journal of publication | RSC Adv. |
Year of publication | 2017 |
Journal volume | 7 |
Journal issue | 79 |
Pages of publication | 50150 |
a | 14.4184 ± 0.0016 Å |
b | 8.3825 ± 0.0008 Å |
c | 9.4836 ± 0.0009 Å |
α | 90° |
β | 118.531 ± 0.001° |
γ | 90° |
Cell volume | 1007.01 ± 0.18 Å3 |
Cell temperature | 293 ± 2 K |
Ambient diffraction temperature | 293 ± 2 K |
Number of distinct elements | 5 |
Space group number | 15 |
Hermann-Mauguin space group symbol | C 1 2/c 1 |
Hall space group symbol | -C 2yc |
Residual factor for all reflections | 0.0236 |
Residual factor for significantly intense reflections | 0.023 |
Weighted residual factors for significantly intense reflections | 0.0617 |
Weighted residual factors for all reflections included in the refinement | 0.0624 |
Goodness-of-fit parameter for all reflections included in the refinement | 1.003 |
Diffraction radiation wavelength | 0.71073 Å |
Diffraction radiation type | MoKα |