Information card for entry 7229607
Formula | C24 H40 Fe P2 |
Calculated formula | C24 H40 Fe P2 |
Title of publication | Two lanthanide metal‒organic frameworks as sensitive luminescent sensors for the detection of Cr2+ and Cr2O72− in aqueous solutions |
Authors of publication | Huang, X. H.; Shi, L.; Ying, S. M.; Yan, G. Y.; Liu, L. H.; Sun, Y. Q.; Chen, Y. P. |
Journal of publication | CrystEngComm |
Year of publication | 2018 |
Journal volume | 20 |
Journal issue | 2 |
Pages of publication | 189 |
a | 16.744 ± 0.0005 Å |
b | 8.987 ± 0.0002 Å |
c | 31.956 ± 0.0011 Å |
α | 90 ± 0.0017° |
β | 101.227 ± 0.0016° |
γ | 90 ± 0.0017° |
Cell volume | 4716.7 ± 0.2 Å3 |
Cell temperature | 150 ± 0.1 K |
Ambient diffraction temperature | 150 ± 0.1 K |
Number of distinct elements | 4 |
Space group number | 15 |
Hermann-Mauguin space group symbol | C 1 2/c 1 |
Hall space group symbol | -C 2yc |
Residual factor for all reflections | 0.0347 |
Residual factor for significantly intense reflections | 0.0307 |
Weighted residual factors for significantly intense reflections | 0.0813 |
Weighted residual factors for all reflections included in the refinement | 0.0839 |
Goodness-of-fit parameter for all reflections included in the refinement | 1.052 |
Diffraction radiation wavelength | 0.7107 Å |
Diffraction radiation type | MoKα |