Information card for entry 7229613
Chemical name | 1-(4-iodophenyl)-3-phenyltriazenide N1-oxide |
Formula | C12 H10 I N3 O |
Calculated formula | C12 H10 I N3 O |
SMILES | Ic1ccc(NN=N(=O)c2ccccc2)cc1 |
Title of publication | Understanding the crystalline formation of triazene N-oxides and the role of halogen⋯π interactions |
Authors of publication | Martins, Marcos A. P.; Salbego, Paulo R. S.; de Moraes, Guilherme A.; Bender, Caroline R.; Zambiazi, Priscilla J.; Orlando, Tainára; Pagliari, Anderson B.; Frizzo, Clarissa P.; Hörner, Manfredo |
Journal of publication | CrystEngComm |
Year of publication | 2018 |
Journal volume | 20 |
Journal issue | 1 |
Pages of publication | 96 |
a | 4.7465 ± 0.0003 Å |
b | 9.9491 ± 0.0006 Å |
c | 26.6177 ± 0.0014 Å |
α | 90° |
β | 90° |
γ | 90° |
Cell volume | 1256.98 ± 0.13 Å3 |
Cell temperature | 293 ± 2 K |
Ambient diffraction temperature | 293 ± 2 K |
Number of distinct elements | 5 |
Space group number | 19 |
Hermann-Mauguin space group symbol | P 21 21 21 |
Hall space group symbol | P 2ac 2ab |
Residual factor for all reflections | 0.0854 |
Residual factor for significantly intense reflections | 0.0466 |
Weighted residual factors for significantly intense reflections | 0.1145 |
Weighted residual factors for all reflections included in the refinement | 0.1316 |
Goodness-of-fit parameter for all reflections included in the refinement | 1.037 |
Diffraction radiation probe | x-ray |
Diffraction radiation wavelength | 0.71073 Å |
Diffraction radiation type | MoKα |