Information card for entry 7229656
Chemical name | (i-PrN?N)NiBr2 |
Formula | C49 H49 Br2 N2 Ni |
Calculated formula | C49 H49 Br2 N2 Ni |
SMILES | [Ni]1(Br)(Br)[N](=C(C(=[N]1c1c(cccc1C(C)C)C(C)C)C)C)c1c(cc(cc1C(c1ccccc1)c1ccccc1)C)C(c1ccccc1)c1ccccc1 |
Title of publication | Ligand steric effects on α-diimine nickel catalyzed ethylene and 1-hexene polymerization |
Authors of publication | Sun, Jinlong; Wang, Fuzhou; Li, Weimin; Chen, Min |
Journal of publication | RSC Advances |
Year of publication | 2017 |
Journal volume | 7 |
Journal issue | 87 |
Pages of publication | 55051 |
a | 25.465 ± 0.002 Å |
b | 17.0368 ± 0.0017 Å |
c | 22.342 ± 0.002 Å |
α | 90° |
β | 115.936 ± 0.004° |
γ | 90° |
Cell volume | 8716.7 ± 1.4 Å3 |
Cell temperature | 298 ± 2 K |
Ambient diffraction temperature | 298 ± 2 K |
Number of distinct elements | 5 |
Space group number | 14 |
Hermann-Mauguin space group symbol | P 1 21/c 1 |
Hall space group symbol | -P 2ybc |
Residual factor for all reflections | 0.1844 |
Residual factor for significantly intense reflections | 0.1324 |
Weighted residual factors for significantly intense reflections | 0.3405 |
Weighted residual factors for all reflections included in the refinement | 0.377 |
Goodness-of-fit parameter for all reflections included in the refinement | 1.132 |
Diffraction radiation wavelength | 0.71073 Å |
Diffraction radiation type | MoKα |