Information card for entry 7229681
Formula | C124 H111 N13 O22 Tb4 |
Calculated formula | C124 H111 N13 O22 Tb4 |
Title of publication | A series of planar tetranuclear lanthanide complexes: axial ligand modulated magnetic dynamics in Dy4 species |
Authors of publication | Zhang, Ya-Xin; Li, Meng; Liu, Bi-Ying; Wu, Zhi-Lei; Wei, Hai-Ying; Wang, Wen-Min |
Journal of publication | RSC Advances |
Year of publication | 2017 |
Journal volume | 7 |
Journal issue | 87 |
Pages of publication | 55523 |
a | 16.038 ± 0.0006 Å |
b | 19.7829 ± 0.0008 Å |
c | 20.3633 ± 0.0008 Å |
α | 76.708 ± 0.001° |
β | 73.048 ± 0.001° |
γ | 87.716 ± 0.001° |
Cell volume | 6012 ± 0.4 Å3 |
Cell temperature | 293 ± 2 K |
Ambient diffraction temperature | 293 ± 2 K |
Number of distinct elements | 5 |
Space group number | 2 |
Hermann-Mauguin space group symbol | P -1 |
Hall space group symbol | -P 1 |
Residual factor for all reflections | 0.0466 |
Residual factor for significantly intense reflections | 0.0369 |
Weighted residual factors for significantly intense reflections | 0.0768 |
Weighted residual factors for all reflections included in the refinement | 0.0811 |
Goodness-of-fit parameter for all reflections included in the refinement | 1.034 |
Diffraction radiation wavelength | 0.71073 Å |
Diffraction radiation type | MoKα |