Information card for entry 7230637
Formula | C26 H17 N4 O13 Tb |
Calculated formula | C26 H17 N4 O13 Tb |
Title of publication | Effects of template molecules on the structures and luminescence intensities of a series of porous Tb-MOFs based on the 2-nitroterephthalate ligand |
Authors of publication | Ren, Yi-Xia; Zhao, Xiao-Long; Wang, Zhi-Xiang; Pan, Yong; Li, Hui-Ping; Wang, Fei-Yan; Zhu, Shao-Feng; Shao, Chen-Hui |
Journal of publication | RSC Advances |
Year of publication | 2018 |
Journal volume | 8 |
Journal issue | 31 |
Pages of publication | 17497 |
a | 11.98 ± 0.0005 Å |
b | 14.578 ± 0.0006 Å |
c | 15.2371 ± 0.0006 Å |
α | 90° |
β | 105.531 ± 0.001° |
γ | 90° |
Cell volume | 2563.91 ± 0.18 Å3 |
Cell temperature | 296 ± 2 K |
Ambient diffraction temperature | 296 ± 2 K |
Number of distinct elements | 5 |
Space group number | 14 |
Hermann-Mauguin space group symbol | P 1 21/n 1 |
Hall space group symbol | -P 2yn |
Residual factor for all reflections | 0.0374 |
Residual factor for significantly intense reflections | 0.0266 |
Weighted residual factors for significantly intense reflections | 0.0577 |
Weighted residual factors for all reflections included in the refinement | 0.0605 |
Goodness-of-fit parameter for all reflections included in the refinement | 1.077 |
Diffraction radiation wavelength | 0.71073 Å |
Diffraction radiation type | MoKα |