Information card for entry 7230886
Formula | C87.87 H87.74 Au4 Cl11.73 O10 P4 Sn4 |
Calculated formula | C87.876 H87.752 Au4 Cl11.752 O10 P4 Sn4 |
Title of publication | A H-shaped heterometallic Sn4Au4 system with guest-tuneable multicolour and selective luminescence sensing properties |
Authors of publication | Jobbágy, Csaba; Baranyai, Péter; Gömöry, Ágnes; Deák, Andrea |
Journal of publication | CrystEngComm |
Year of publication | 2018 |
Journal volume | 20 |
Journal issue | 39 |
Pages of publication | 5935 |
a | 9.8918 ± 0.001 Å |
b | 14.2582 ± 0.0013 Å |
c | 39.597 ± 0.003 Å |
α | 90° |
β | 93.948 ± 0.002° |
γ | 90° |
Cell volume | 5571.5 ± 0.9 Å3 |
Cell temperature | 103 ± 2 K |
Ambient diffraction temperature | 103 ± 2 K |
Number of distinct elements | 7 |
Space group number | 14 |
Hermann-Mauguin space group symbol | P 1 21/c 1 |
Hall space group symbol | -P 2ybc |
Residual factor for all reflections | 0.0941 |
Residual factor for significantly intense reflections | 0.0686 |
Weighted residual factors for significantly intense reflections | 0.1628 |
Weighted residual factors for all reflections included in the refinement | 0.1782 |
Goodness-of-fit parameter for all reflections included in the refinement | 1.073 |
Diffraction radiation wavelength | 0.71075 Å |
Diffraction radiation type | MoKα |