Information card for entry 7231522
Formula | C12 H10 N2 O2 |
Calculated formula | C12 H10 N2 O2 |
Title of publication | Zwitterion formation and subsequent carboxylate‒pyridinium NH synthon generation through isomerization of 2-anilinonicotinic acid |
Authors of publication | Yue, Pengyun; Dong, Caiqiao; Zhang, Mingtao; Xu, Danrui; Parkin, Sean; Li, Tonglei; Li, Conggang; Yu, Faquan; Long, Sihui |
Journal of publication | CrystEngComm |
Year of publication | 2018 |
Journal volume | 20 |
Journal issue | 40 |
Pages of publication | 6126 |
a | 10.8415 ± 0.0002 Å |
b | 13.7771 ± 0.0004 Å |
c | 6.9369 ± 0.0002 Å |
α | 90° |
β | 102.685 ± 0.001° |
γ | 90° |
Cell volume | 1010.84 ± 0.05 Å3 |
Cell temperature | 90 ± 0.2 K |
Ambient diffraction temperature | 90 ± 0.2 K |
Number of distinct elements | 4 |
Space group number | 14 |
Hermann-Mauguin space group symbol | P 1 21/c 1 |
Hall space group symbol | -P 2ybc |
Residual factor for all reflections | 0.0803 |
Residual factor for significantly intense reflections | 0.0488 |
Weighted residual factors for significantly intense reflections | 0.1247 |
Weighted residual factors for all reflections included in the refinement | 0.1421 |
Goodness-of-fit parameter for all reflections included in the refinement | 1.062 |
Diffraction radiation wavelength | 0.71073 Å |
Diffraction radiation type | MoKα |