Information card for entry 7231976
Formula |
C2 H2 K2 N8 O5 |
Calculated formula |
C2 H2 K2 N8 O5 |
Title of publication |
Alkali metal salts of 3,6-dinitramino-1,2,4,5-tetrazine: promising nitrogen-rich energetic materials |
Authors of publication |
Zhang, Tianhe; Du, Jiang; Li, Zhimin; Lin, Xinyu; Wang, Lin; Yang, Li; Zhang, Tonglai |
Journal of publication |
CrystEngComm |
Year of publication |
2019 |
Journal volume |
21 |
Journal issue |
4 |
Pages of publication |
765 |
a |
24.506 ± 0.005 Å |
b |
8.0284 ± 0.0016 Å |
c |
4.7044 ± 0.0009 Å |
α |
90° |
β |
90° |
γ |
90° |
Cell volume |
925.6 ± 0.3 Å3 |
Cell temperature |
153 ± 2 K |
Ambient diffraction temperature |
153.15 K |
Number of distinct elements |
5 |
Space group number |
52 |
Hermann-Mauguin space group symbol |
P n n a |
Hall space group symbol |
-P 2a 2bc |
Residual factor for all reflections |
0.036 |
Residual factor for significantly intense reflections |
0.0356 |
Weighted residual factors for significantly intense reflections |
0.0881 |
Weighted residual factors for all reflections included in the refinement |
0.0884 |
Goodness-of-fit parameter for all reflections included in the refinement |
1.166 |
Diffraction radiation wavelength |
0.71073 Å |
Diffraction radiation type |
MoKα |
Yes |
No |
No |