Information card for entry 7232011
Formula | C9 H14 Br6 N Sb |
Calculated formula | C9 H14 Br6 N Sb |
Title of publication | Halogen bonding-assisted assembly of bromoantimonate(v) and polybromide-bromoantimonate-based frameworks |
Authors of publication | Adonin, Sergey A.; Bondarenko, Mikhail A.; Novikov, Alexander S.; Abramov, Pavel A.; Plyusnin, Pavel E.; Sokolov, Maxim N.; Fedin, Vladimir P. |
Journal of publication | CrystEngComm |
Year of publication | 2019 |
Journal volume | 21 |
Journal issue | 5 |
Pages of publication | 850 |
a | 7.4277 ± 0.0005 Å |
b | 14.1293 ± 0.0008 Å |
c | 16.7699 ± 0.0007 Å |
α | 90° |
β | 90° |
γ | 90° |
Cell volume | 1759.97 ± 0.17 Å3 |
Cell temperature | 130 ± 2 K |
Ambient diffraction temperature | 130 ± 2 K |
Number of distinct elements | 5 |
Space group number | 19 |
Hermann-Mauguin space group symbol | P 21 21 21 |
Hall space group symbol | P 2ac 2ab |
Residual factor for all reflections | 0.0829 |
Residual factor for significantly intense reflections | 0.0674 |
Weighted residual factors for significantly intense reflections | 0.1544 |
Weighted residual factors for all reflections included in the refinement | 0.1685 |
Goodness-of-fit parameter for all reflections included in the refinement | 1.048 |
Diffraction radiation probe | x-ray |
Diffraction radiation wavelength | 0.71073 Å |
Diffraction radiation type | MoKα |