Information card for entry 7232666
Formula | C24 H18 Cu2 O10 |
Calculated formula | C24 H18 Cu2 O10 |
Title of publication | Two copper-based MOFs constructed from a linear diisophthalate linker: supramolecular isomerism and gas adsorption properties |
Authors of publication | He, Minghui; Xu, Tingting; Jiang, Zhenzhen; Yu, Xinjian; Zou, Ying; Yang, Luyao; Wang, Xiaojuan; Wang, Xia; He, Yabing |
Journal of publication | CrystEngComm |
Year of publication | 2019 |
Journal volume | 21 |
Journal issue | 20 |
Pages of publication | 3192 |
a | 18.5984 ± 0.0009 Å |
b | 18.5984 ± 0.0009 Å |
c | 38.5338 ± 0.0018 Å |
α | 90° |
β | 90° |
γ | 120° |
Cell volume | 11543.1 ± 1 Å3 |
Cell temperature | 100 ± 2 K |
Ambient diffraction temperature | 100 ± 2 K |
Number of distinct elements | 4 |
Space group number | 166 |
Hermann-Mauguin space group symbol | R -3 m :H |
Hall space group symbol | -R 3 2" |
Residual factor for all reflections | 0.0634 |
Residual factor for significantly intense reflections | 0.0511 |
Weighted residual factors for significantly intense reflections | 0.1733 |
Weighted residual factors for all reflections included in the refinement | 0.1868 |
Goodness-of-fit parameter for all reflections included in the refinement | 1.034 |
Diffraction radiation wavelength | 0.71073 Å |
Diffraction radiation type | MoKα |