Information card for entry 7232693
Chemical name | N-(triphenylacetyl)-L-tyrosine |
Formula | C29 H25 N O4 |
Calculated formula | C29 H25 N O4 |
Title of publication | Transfer of chirality in N-triphenylacetylamino acids and chiral derivatives of N-triphenylacetyl Gly‒Gly dipeptide and control of their assembly with steric constraints |
Authors of publication | Bendzińska-Berus, Wioletta; Jelecki, Maciej; Kwit, Marcin; Rychlewska, Urszula |
Journal of publication | CrystEngComm |
Year of publication | 2019 |
Journal volume | 21 |
Journal issue | 22 |
Pages of publication | 3420 |
a | 9.1939 ± 0.0004 Å |
b | 10.3126 ± 0.0004 Å |
c | 24.1891 ± 0.0008 Å |
α | 90° |
β | 90° |
γ | 90° |
Cell volume | 2293.44 ± 0.15 Å3 |
Cell temperature | 100 ± 2 K |
Ambient diffraction temperature | 100 ± 2 K |
Number of distinct elements | 4 |
Space group number | 19 |
Hermann-Mauguin space group symbol | P 21 21 21 |
Hall space group symbol | P 2ac 2ab |
Residual factor for all reflections | 0.0581 |
Residual factor for significantly intense reflections | 0.0431 |
Weighted residual factors for significantly intense reflections | 0.0841 |
Weighted residual factors for all reflections included in the refinement | 0.0925 |
Goodness-of-fit parameter for all reflections included in the refinement | 1.059 |
Diffraction radiation wavelength | 0.71073 Å |
Diffraction radiation type | MoKα |