Information card for entry 7232697
Formula | C40 H44 Cl2 Co4 N24 O9 |
Calculated formula | C40 H44 Cl2 Co4 N24 O9 |
Title of publication | Three new metal coordination polymers of bifunctional imidazolate/tetrazolate bridges: the only example of a three-dimensional framework based on rare [Co4(μ3-OH)2(μ2-Cl)2]4+ mixed oxo-chloro-clusters |
Authors of publication | Yang, Lili; Zhou, Jian; Zou, Hua-Hong; Tang, Qiuling |
Journal of publication | RSC Advances |
Year of publication | 2019 |
Journal volume | 9 |
Journal issue | 23 |
Pages of publication | 13082 |
a | 32.117 ± 0.004 Å |
b | 6.5151 ± 0.0008 Å |
c | 25.559 ± 0.003 Å |
α | 90° |
β | 113.333 ± 0.003° |
γ | 90° |
Cell volume | 4910.7 ± 1 Å3 |
Cell temperature | 296 ± 2 K |
Ambient diffraction temperature | 296 ± 2 K |
Number of distinct elements | 6 |
Space group number | 15 |
Hermann-Mauguin space group symbol | C 1 2/c 1 |
Hall space group symbol | -C 2yc |
Residual factor for all reflections | 0.0622 |
Residual factor for significantly intense reflections | 0.0471 |
Weighted residual factors for significantly intense reflections | 0.126 |
Weighted residual factors for all reflections included in the refinement | 0.1387 |
Goodness-of-fit parameter for all reflections included in the refinement | 1.057 |
Diffraction radiation wavelength | 0.71073 Å |
Diffraction radiation type | MoKα |