Information card for entry 7233050
Formula | C38 H38 Br4 N2 O2 Zn2 |
Calculated formula | C38 H38 Br4 N2 O2 Zn2 |
Title of publication | A coloring tool for spiropyrans: solid state metal‒organic complexation versus salification |
Authors of publication | Seiler, Vanessa Kristina; Robeyns, Koen; Tumanov, Nikolay; Cinčić, Dominik; Wouters, Johan; Champagne, Benoit; Leyssens, Tom |
Journal of publication | CrystEngComm |
Year of publication | 2019 |
Journal volume | 21 |
Journal issue | 33 |
Pages of publication | 4925 |
a | 9.3 ± 0.0008 Å |
b | 9.3023 ± 0.0008 Å |
c | 11.3137 ± 0.001 Å |
α | 94.166 ± 0.007° |
β | 108.407 ± 0.008° |
γ | 96.344 ± 0.007° |
Cell volume | 916.98 ± 0.15 Å3 |
Cell temperature | 100 ± 2 K |
Ambient diffraction temperature | 100 ± 2 K |
Number of distinct elements | 6 |
Space group number | 2 |
Hermann-Mauguin space group symbol | P -1 |
Hall space group symbol | -P 1 |
Residual factor for all reflections | 0.0776 |
Residual factor for significantly intense reflections | 0.0673 |
Weighted residual factors for significantly intense reflections | 0.1822 |
Weighted residual factors for all reflections included in the refinement | 0.1899 |
Goodness-of-fit parameter for all reflections included in the refinement | 1.079 |
Diffraction radiation wavelength | 0.77936 Å |
Diffraction radiation type | synchrotron |