Information card for entry 7233186
Formula | C36 H22 F12 Ir N4 P |
Calculated formula | C36 H22 F12 Ir N4 P |
Title of publication | Pulsed-current versus constant-voltage light-emitting electrochemical cells with trifluoromethyl-substituted cationic iridium(III) complexes |
Authors of publication | Nail M. Shavaleev; Rosario Scopelliti; Michael Gratzel; Mohammad K. Nazeeruddin; Antonio Pertegas; Cristina Roldan-Carmona; Daniel Tordera; Henk J. Bolink |
Journal of publication | Journal of Materials Chemistry C |
Year of publication | 2013 |
Journal volume | 1 |
Pages of publication | 2241 - 2248 |
a | 10.557 ± 0.005 Å |
b | 33.014 ± 0.01 Å |
c | 10.957 ± 0.003 Å |
α | 90° |
β | 118.22 ± 0.02° |
γ | 90° |
Cell volume | 3365 ± 2 Å3 |
Cell temperature | 100 ± 2 K |
Ambient diffraction temperature | 100 ± 2 K |
Number of distinct elements | 6 |
Space group number | 14 |
Hermann-Mauguin space group symbol | P 1 21/c 1 |
Hall space group symbol | -P 2ybc |
Residual factor for all reflections | 0.0323 |
Residual factor for significantly intense reflections | 0.0277 |
Weighted residual factors for significantly intense reflections | 0.0671 |
Weighted residual factors for all reflections included in the refinement | 0.0703 |
Goodness-of-fit parameter for all reflections included in the refinement | 1.104 |
Diffraction radiation wavelength | 0.71073 Å |
Diffraction radiation type | MoKα |