Information card for entry 7233193
Formula | C18 H22 N4 O6 |
Calculated formula | C18 H22 N4 O6 |
Title of publication | Ferroelastic phase transition and switchable dielectric behavior associated with ordering of molecular motion in a perovskite-like architectured supramolecular cocrystal |
Authors of publication | Zhihua Sun; Xinqiang Wang; Junhua Luo; Shuquan Zhang; Daqiang Yuan; Maochun Hong |
Journal of publication | Journal of Materials Chemistry C |
Year of publication | 2013 |
Journal volume | 1 |
Pages of publication | 2561 - 2567 |
a | 9.785 ± 0.002 Å |
b | 13.7474 ± 0.0018 Å |
c | 13.7474 ± 0.0018 Å |
α | 80.157 ± 0.014° |
β | 84.13 ± 0.02° |
γ | 84.13 ± 0.02° |
Cell volume | 1805.7 ± 0.5 Å3 |
Cell temperature | 100 ± 2 K |
Ambient diffraction temperature | 100 ± 2 K |
Number of distinct elements | 4 |
Space group number | 2 |
Hermann-Mauguin space group symbol | P -1 |
Hall space group symbol | -P 1 |
Residual factor for all reflections | 0.1193 |
Residual factor for significantly intense reflections | 0.105 |
Weighted residual factors for significantly intense reflections | 0.2386 |
Weighted residual factors for all reflections included in the refinement | 0.2449 |
Goodness-of-fit parameter for all reflections included in the refinement | 1.184 |
Diffraction radiation wavelength | 0.71073 Å |
Diffraction radiation type | MoKα |