Information card for entry 7233447
Formula | C80 H80 Cu4 I4 N4 P4 |
Calculated formula | C80 H80 Cu4 I4 N4 P4 |
SMILES | [I]12[Cu]3([I]4[Cu]5([I]3[Cu]1([I]5[Cu]24[P](c1ccc(N(C)C)cc1)(c1ccccc1)c1ccccc1)[P](c1ccc(cc1)N(C)C)(c1ccccc1)c1ccccc1)[P](c1ccc(cc1)N(C)C)(c1ccccc1)c1ccccc1)[P](c1ccc(cc1)N(C)C)(c1ccccc1)c1ccccc1 |
Title of publication | Using cuprophilicity as a multi-responsive chromophore switching color in response to temperature, mechanical force and solvent vapors |
Authors of publication | Xiao-Chen Shan; Fei-Long Jiang; Lian Chen; Ming-Yan Wu; Jie Pan; Xiu-Yan Wan; Mao-Chun Hong |
Journal of publication | Journal of Materials Chemistry C |
Year of publication | 2013 |
Journal volume | 1 |
Pages of publication | 4339 - 4349 |
a | 13.663 ± 0.002 Å |
b | 25.134 ± 0.004 Å |
c | 28.011 ± 0.005 Å |
α | 90° |
β | 98.145 ± 0.003° |
γ | 90° |
Cell volume | 9522 ± 3 Å3 |
Cell temperature | 293 ± 2 K |
Ambient diffraction temperature | 293 ± 2 K |
Number of distinct elements | 6 |
Space group number | 14 |
Hermann-Mauguin space group symbol | P 1 21/c 1 |
Hall space group symbol | -P 2ybc |
Residual factor for all reflections | 0.0645 |
Residual factor for significantly intense reflections | 0.0494 |
Weighted residual factors for significantly intense reflections | 0.1523 |
Weighted residual factors for all reflections included in the refinement | 0.1686 |
Goodness-of-fit parameter for all reflections included in the refinement | 0.992 |
Diffraction radiation wavelength | 0.71073 Å |
Diffraction radiation type | MoKα |