Information card for entry 7233484
Formula | C46 H28 N6 |
Calculated formula | C46 H28 N6 |
Title of publication | Highly efficient deep-red organic electrophosphorescent devices with excellent operational stability using bis(indoloquinoxalinyl) derivatives as the host materials |
Authors of publication | Tsu-Hui Su; Chun-Hsiang Fan; Yu-Han Ou-Yang; Lun-Chia Hsu; Chien-Hong Cheng |
Journal of publication | Journal of Materials Chemistry C |
Year of publication | 2013 |
Journal volume | 1 |
Pages of publication | 5084 - 5092 |
a | 5.8757 ± 0.0008 Å |
b | 11.0628 ± 0.0015 Å |
c | 12.9069 ± 0.0017 Å |
α | 75.27 ± 0.003° |
β | 78.072 ± 0.003° |
γ | 87.7 ± 0.003° |
Cell volume | 793.81 ± 0.19 Å3 |
Cell temperature | 100 ± 2 K |
Ambient diffraction temperature | 100 ± 2 K |
Number of distinct elements | 3 |
Space group number | 2 |
Hermann-Mauguin space group symbol | P -1 |
Hall space group symbol | -P 1 |
Residual factor for all reflections | 0.0817 |
Residual factor for significantly intense reflections | 0.0728 |
Weighted residual factors for significantly intense reflections | 0.1748 |
Weighted residual factors for all reflections included in the refinement | 0.1794 |
Goodness-of-fit parameter for all reflections included in the refinement | 1.081 |
Diffraction radiation wavelength | 0.71073 Å |
Diffraction radiation type | MoKα |