Information card for entry 7233486
Formula | C60 H132 Ag4 N12 O10 |
Calculated formula | C60 H132 Ag4 N12 O10 |
Title of publication | Solution-based beta-diketonate silver ink for direct printing of highly conductive features on a flexible substrate |
Authors of publication | Chen-Ni Chen; Teng-Yuan Dong; Ting-Chang Chang; Min-Chen Chen; Ho-Lin Tsai; Weng-Sing Hwang |
Journal of publication | Journal of Materials Chemistry C |
Year of publication | 2013 |
Journal volume | 1 |
Pages of publication | 5161 - 5168 |
a | 10.361 ± 0.0004 Å |
b | 14.0189 ± 0.0004 Å |
c | 14.7013 ± 0.0004 Å |
α | 81.415 ± 0.002° |
β | 71.874 ± 0.002° |
γ | 70.406 ± 0.002° |
Cell volume | 1909.47 ± 0.11 Å3 |
Cell temperature | 200 ± 2 K |
Ambient diffraction temperature | 200 ± 2 K |
Number of distinct elements | 5 |
Space group number | 2 |
Hermann-Mauguin space group symbol | P -1 |
Hall space group symbol | -P 1 |
Residual factor for all reflections | 0.0496 |
Residual factor for significantly intense reflections | 0.0334 |
Weighted residual factors for significantly intense reflections | 0.0881 |
Weighted residual factors for all reflections included in the refinement | 0.1059 |
Goodness-of-fit parameter for all reflections included in the refinement | 1.127 |
Diffraction radiation wavelength | 0.71073 Å |
Diffraction radiation type | MoKα |