Information card for entry 7233498
Formula | C64 H82 N4 O2 |
Calculated formula | C64 H82 N4 O2 |
Title of publication | Polymorph, assembly, luminescence and semiconductor properties of a quinacridone derivative with extended pi-conjugated framework |
Authors of publication | Chenguang Wang; Dong Chen; Weiping Chen; Shanyong Chen; Kaiqi Ye; Hongyu Zhang; Jingying Zhang; Yue Wang |
Journal of publication | Journal of Materials Chemistry C |
Year of publication | 2013 |
Journal volume | 1 |
Pages of publication | 5548 - 5556 |
a | 9.04 ± 0.008 Å |
b | 10.523 ± 0.007 Å |
c | 14.736 ± 0.01 Å |
α | 75.89 ± 0.02° |
β | 89.97 ± 0.03° |
γ | 89.11 ± 0.03° |
Cell volume | 1359.3 ± 1.8 Å3 |
Cell temperature | 293 ± 2 K |
Ambient diffraction temperature | 293 ± 2 K |
Number of distinct elements | 4 |
Space group number | 2 |
Hermann-Mauguin space group symbol | P -1 |
Hall space group symbol | -P 1 |
Residual factor for all reflections | 0.2425 |
Residual factor for significantly intense reflections | 0.09 |
Weighted residual factors for significantly intense reflections | 0.2052 |
Weighted residual factors for all reflections included in the refinement | 0.2817 |
Goodness-of-fit parameter for all reflections included in the refinement | 0.954 |
Diffraction radiation wavelength | 0.71073 Å |
Diffraction radiation type | MoKα |