Information card for entry 7233515
Formula | C36 H26 S4 |
Calculated formula | C36 H26 S4 |
Title of publication | Substitution effects on the electrical tranporting properties of tetrathia[22]annulene[2,1,2,1]: experimental and theoretical investigations |
Authors of publication | Jing Zhang; Zhiying Ma; Qian Zhang; Tarunpreet Singh Virk; Hua Geng; Dong Wang; Wei Xu; Zhigang Shuai; Kamaljit Singh; Wenping Hu; Daoben Zhu |
Journal of publication | Journal of Materials Chemistry C |
Year of publication | 2013 |
Journal volume | 1 |
Pages of publication | 5765 - 5771 |
a | 7.262 ± 0.003 Å |
b | 9.148 ± 0.005 Å |
c | 11.131 ± 0.005 Å |
α | 102.635 ± 0.008° |
β | 94.961 ± 0.007° |
γ | 106.756 ± 0.005° |
Cell volume | 682 ± 0.6 Å3 |
Cell temperature | 173 ± 2 K |
Ambient diffraction temperature | 173 ± 2 K |
Number of distinct elements | 3 |
Space group number | 2 |
Hermann-Mauguin space group symbol | P -1 |
Hall space group symbol | -P 1 |
Residual factor for all reflections | 0.0496 |
Residual factor for significantly intense reflections | 0.0462 |
Weighted residual factors for significantly intense reflections | 0.118 |
Weighted residual factors for all reflections included in the refinement | 0.1213 |
Goodness-of-fit parameter for all reflections included in the refinement | 1.08 |
Diffraction radiation wavelength | 0.71073 Å |
Diffraction radiation type | MoKα |