Information card for entry 7233522
Formula | C42 H52 S Si2 |
Calculated formula | C42 H52 S Si2 |
Title of publication | Bitrialkylsilylethynyl thienoacenes: synthesis, molecular conformation and crystal packing, and their field-effect properties |
Authors of publication | Weifeng Zhang; Ji Zhang; Xiangyang Chen; Zupan Mao; Xiaodong Xie; Liping Wang; Yi Liao; Gui Yu; Yunqi Liu; Daoben Zhu |
Journal of publication | Journal of Materials Chemistry C |
Year of publication | 2012 |
Journal volume | 1 |
Pages of publication | 6403 - 6410 |
a | 8.545 ± 0.002 Å |
b | 17.738 ± 0.004 Å |
c | 25.019 ± 0.006 Å |
α | 90° |
β | 90.907 ± 0.004° |
γ | 90° |
Cell volume | 3791.7 ± 1.5 Å3 |
Cell temperature | 173 ± 2 K |
Ambient diffraction temperature | 173 ± 2 K |
Number of distinct elements | 4 |
Space group number | 14 |
Hermann-Mauguin space group symbol | P 1 21/c 1 |
Hall space group symbol | -P 2ybc |
Residual factor for all reflections | 0.1168 |
Residual factor for significantly intense reflections | 0.0985 |
Weighted residual factors for significantly intense reflections | 0.1742 |
Weighted residual factors for all reflections included in the refinement | 0.1834 |
Goodness-of-fit parameter for all reflections included in the refinement | 1.234 |
Diffraction radiation wavelength | 0.71073 Å |
Diffraction radiation type | MoKα |